{"text_format":"1","workbook":"xlsx","n_sheets":18,"sheets":["Instructions","Cost Estimate Summary","Inflation Summary & Upload","Inflation Tables","CEWB Translation Sheet","Culpeper Workbook","Suggested Contingencies","CN Estimate Tool","Quantity Calculations","Earthwork","Suggested Values","Unit Prices","Unit Cost Norms","FormData","PE Estimate Tool","PE % Check","PE Form Data","PE Hour Norms"],"not_rendered":{"charts":0,"images":3,"macros":1,"external_links":5,"defined_names":275,"comments":7,"pivot_tables":0},"unopened":[],"bounds":{"document_bytes":16777216,"sheet_cells":100000,"rows_first":2000,"rows_last":500,"rows_between":2000,"halvings":0,"cell_chars":16384,"cell_head_chars":4096},"cells_cut":0,"cells_raw":0,"read":"whole","date_system":"1900"}

{"sheet":"Instructions","index":0,"n_rows":43,"n_cols":8,"rows_kept":43,"cut":false,"hidden":false,"merged":[[42,1,43,4],[9,7,17,11],[8,7,8,11],[1,0,2,5],[5,1,5,4],[7,1,41,4],[6,1,6,4]]}
[]
["CULPEPER CONCEPT ESTIMATE WORKBOOK"]
[]
[]
[]
[null,"INSTRUCTIONS"]
[null,"Follow these steps:"]
[null,"1. Enable macros & active content.\n2. The next tab is the Cost Estimate Summary, also known as the VDOT Cost Estimate Workbook or CEWB. It will auto-populate as you fill out the other tabs and should not be modified.\n3. Enter the Project Information, RW Estimate, and Project Schedule on the Culpeper Workbook tab.\n4. Go to the CN Estimate Tool tab and follow the directions to complete the CN estimate.\n5. Go to the PE Estimate Tool tab and complete the PE Estimate.   \n6. Review the Suggested Contingencies tab. Consider the level of risk and estimate quality when finalizing contingencies for PE, RW, and CN. Moderately complex and most complex projects may need additional contingency analysis in accordance with the VDOT Cost Estimating Manual.\n7. Go back to the Culpeper Workbook tab to review the overall project contingency, and compare to the low, MLE, and high values in accordance with the VDOT Cost Estimating Manual. Adjust contingencies as necessary. Contingencies beyond the low and high values require VDOT Administration approval.  \n8. All known assumptions and risks should be listed in a separate document filed with the project.   \n9. The entire estimate, with the assumptions and risks document, must be reviewed by another engineer.\n10. Press the \"Print Workbook\" button to PDF the needed sheets and include with the Cost Estimate Package. The dark green fields in the Project Estimate table on the Culpeper Workbook tab can be entered into the Smart Portal for funding applications."]
{"$rows_left_out":36}
{"sheet":"Cost Estimate Summary","index":1,"n_rows":254,"n_cols":21,"rows_kept":254,"cut":false,"hidden":false,"merged":[[95,4,95,5],[91,1,91,3],[91,4,91,6],[96,1,96,3],[96,4,96,6],[92,1,92,2],[93,1,93,2],[94,1,94,2],[1,1,1,7],[2,2,2,3],[3,2,3,3],[9,3,9,7],[9,1,9,2],[8,1,8,2],[7,1,7,7],[8,4,8,7],[5,3,5,4],[4,2,4,3],[24,1,24,4],[93,4,93,5],[94,4,94,5],[81,7,82,7],[81,1,82,4],[90,1,90,7],[26,1,28,1],[29,1,29,7],[30,4,30,7],[75,1,77,1],[65,1,65,2],[81,6,82,6],[92,4,92,5],[30,1,30,2],[37,1,37,2],[39,1,39,6],[43,1,43,7],[69,1,69,2],[67,1,67,4],[38,1,38,4],[64,3,64,4],[60,3,60,4],[44,4,44,7],[40,1,42,1]]}
[]
[null,"SYIP PROJECTS\nDETAILED PROJECT COST ESTIMATE SUMMARY\n(Version 2.1: 2/1/2023)",null,null,null,null,null,null,null,"Green Cells require input.  Allowance / Contingency are not necessarily required. All others are auto calculating.  Estimate to be entered based on current dollars and inflation will be applied at the bottom of this workbook for informational purposes only."]
[null,"Portal ID:",{"$f":"'CEWB Translation Sheet'!B4","v":0},null,null,"Project UPC:",{"$f":"'CEWB Translation Sheet'!D4","v":"N/A"},null,null,null,null,null,null,null,null,"Select Phase Risk Type Here (when using different contingency values for each discipline)",null,null,null,null,"Select Phase Risk Type Here (when using one phase contingency value)"]
[null,"Prepared By:",{"$f":"'CEWB Translation Sheet'!B5","v":0},null,null,"Milestone","Creation/Pre Scope",null,null,null,null,null,null,null,null,"Type 1 Percentage",null,"$",null,null,"Type 1 Percentage"]
[null,"Reviewed By:",{"$f":"'CEWB Translation Sheet'!B6","v":0},null,null,null,null,null,null,null,null,null,null,null,null,"Type 2 Deterministic",null,"%",null,null,"Type 2 Deterministic"]
[null,"Project Location:",{"$f":"'CEWB Translation Sheet'!B7","v":"Locality"},{"$f":"'CEWB Translation Sheet'!C7","v":"Arlington County (00)"},null,"Tier Level",{"$f":"'CEWB Translation Sheet'!D6","v":1}]
[null,"Project Complexity Classification",{"$f":"'CEWB Translation Sheet'!B8","v":0},null,null,null,null,null,null,null,null,null,null,null,null,null,null,null,null,null,"Select"]
[null,null,null,null,null,null,null,null,null,null,null,null,null,null,null,null,null,null,null,null,"Type 1 Percentage"]
{"$rows_left_out":247}
{"sheet":"Inflation Summary & Upload","index":2,"n_rows":23,"n_cols":3,"rows_kept":23,"cut":false,"hidden":false,"merged":[[3,1,4,1],[3,2,4,2],[21,0,21,4],[22,0,22,4],[24,0,24,4],[17,0,17,4],[18,0,18,4],[19,0,19,4],[20,0,20,4]]}
[]
[]
[]
[null,"Inflation Factors","Future Cost (including inflation)"]
[]
[null,"Inflation**","Total Cost***"]
["PE Phase Estimate",{"$f":"IFERROR('Inflation Tables'!F4,1)","v":1},{"$f":"'Cost Estimate Summary'!F85*B7","v":310000}]
["RW Phase Estimate ",{"$f":"IFERROR('Inflation Tables'!N4,1)","v":1},{"$f":"'Cost Estimate Summary'!F86*B8","v":0}]
{"$rows_left_out":16}
{"sheet":"Inflation Tables","index":3,"n_rows":114,"n_cols":24,"rows_kept":114,"cut":false,"hidden":true,"merged":[[6,24,7,24],[6,6,7,6],[1,0,1,4],[1,8,1,12],[2,16,2,17],[1,18,1,22],[6,14,7,14]]}
[]
["PE PHASE",null,null,null,null,null,null,null,"RW Phase",null,null,null,null,null,null,null,null,null,"CN Phase"]
["application fiscal year","region_code","FY for Phase Start ","Phase","Multiplier","PE Inflation Multiplier:",null,null,"application fiscal year","region_code","FY for Phase Start ","Phase","Multiplier","RW Inflation Multiplier:",null,null,null,null,"application fiscal year","region_code","FY for Phase Start ","Phase","Multiplier","CN Inflation Multiplier:"]
[2024,"V1P1",2023,"PE",1,{"$f":"INDEX(E4:E136, MATCH(1,  (F7=C4:C136) * (F8=D4:D136), 0))","v":{"$error":"#N/A"}},null,null,2024,"V1R5",2023,"RW",1,{"$f":"INDEX(M4:M128, MATCH(1,  (N7=K4:K128) * (N8=L4:L128), 0))","v":{"$error":"#N/A"}},null,null,null,null,2024,"V1C5",2023,"CN",1,{"$f":"INDEX(W4:W136, MATCH(1,  (X7=U4:U136) * (X8=V4:V136), 0))","v":{"$error":"#N/A"}}]
[2024,"V1P1",2024,"PE",1.08,null,null,null,2024,"V1R5",2024,"RW",1.08,null,null,null,null,null,2024,"V1C5",2024,"CN",1.08]
[2024,"V1P1",2025,"PE",1.1340000000000001,"Fiscal Year",null,null,2024,"V1R5",2025,"RW",1.1340000000000001,"Fiscal Year",null,null,null,null,2024,"V1C5",2025,"CN",1.1340000000000001,"Fiscal Year"]
[2024,"V1P1",2026,"PE",1.1907000000000001,{"$f":"YEAR('Cost Estimate Summary'!D28)+IF(MONTH('Cost Estimate Summary'!D28)>=7,1,0)","v":1900},null,null,2024,"V1R5",2026,"RW",1.1907000000000001,{"$f":"YEAR('Cost Estimate Summary'!D42)+IF(MONTH('Cost Estimate Summary'!D42)>=7,1,0)","v":1900},null,null,null,null,2024,"V1C5",2026,"CN",1.1907000000000001,{"$f":"YEAR('Cost Estimate Summary'!D77)+IF(MONTH('Cost Estimate Summary'!D77)>=7,1,0)","v":1900}]
[2024,"V1P1",2027,"PE",1.2502350000000002,{"$f":"IF('Cost Estimate Summary'!D28>1,\"PE\",\"\")","v":""},null,null,2024,"V1R5",2027,"RW",1.2502350000000002,{"$f":"IF('Cost Estimate Summary'!D42>1,\"RW\",\"\")","v":""},null,null,null,null,2024,"V1C5",2027,"CN",1.2502350000000002,{"$f":"IF('Cost Estimate Summary'!D77>1,\"CN\",\"\")","v":""}]
{"$rows_left_out":107}
{"sheet":"CEWB Translation Sheet","index":4,"n_rows":76,"n_cols":12,"rows_kept":76,"cut":false,"hidden":true,"merged":[]}
[]
[null,null,"Data to CEWB",null,null,null,null,null,null,null,null,"Data from CEWB"]
[]
["Portal ID",{"$f":"IF('Culpeper Workbook'!$B$8=\"UPC\",\"N/A\",'Culpeper Workbook'!$C$8)","v":0},"UPC",{"$f":"IF('Culpeper Workbook'!$B$8=\"UPC\",'Culpeper Workbook'!$C$8,\"N/A\")","v":"N/A"},null,null,null,null,null,null,"PE Inflation",{"$f":"'Inflation Summary & Upload'!B7","v":1}]
["Prep By",{"$f":"'Culpeper Workbook'!C11","v":0},"Milestone","Creation/Pre Scope",null,null,null,null,null,null,"RW Inflation",{"$f":"'Inflation Summary & Upload'!B8","v":1}]
["Rev By",{"$f":"'Culpeper Workbook'!C12","v":0},"Tier",{"$f":"'Culpeper Workbook'!G17","v":1},null,null,null,null,null,null,"CN Inflation",{"$f":"'Inflation Summary & Upload'!B9","v":1}]
["Location",{"$f":"\"Locality\"","v":"Locality"},{"$f":"'Culpeper Workbook'!N67","v":"Arlington County (00)"}]
["Complexity",{"$f":"'Culpeper Workbook'!C13","v":0}]
{"$rows_left_out":69}
{"sheet":"Culpeper Workbook","index":5,"n_rows":67,"n_cols":24,"rows_kept":67,"cut":false,"hidden":false,"merged":[[6,6,6,7],[12,2,12,4],[13,2,13,4],[6,2,6,4],[25,1,25,5],[9,2,9,4],[14,2,14,4],[19,2,19,4],[16,2,16,4],[22,1,23,4],[21,2,21,4],[1,0,2,5],[8,2,8,4],[17,2,17,4],[10,2,10,4],[15,2,15,4],[5,1,5,4],[3,2,3,4],[15,13,15,23],[11,2,11,4],[7,2,7,4],[20,2,20,4],[18,2,18,4],[13,8,13,9],[14,8,14,9],[20,8,23,10],[18,8,19,8],[18,9,19,9],[18,10,19,10],[18,6,18,7],[19,6,19,7],[8,9,8,10],[9,9,9,10],[10,9,10,10],[66,13,66,14],[49,1,49,4],[50,1,50,4],[51,1,51,4],[48,1,48,4],[7,9,7,10],[12,8,12,9],[46,1,46,4],[47,1,47,4],[27,6,27,10],[33,6,33,10],[34,6,34,10],[32,6,32,10],[26,6,26,10],[29,6,29,10],[30,6,30,10],[31,6,31,10],[28,6,28,10],[1,13,1,23],[9,21,9,22],[10,21,10,22],[11,21,11,22],[13,21,13,22],[8,21,8,22]]}
[]
["CULPEPER CONCEPT ESTIMATE WORKBOOK",null,null,null,null,null,null,null,null,null,null,null,null,"ROUNDING BREAKDOWN"]
[null,null,null,null,null,null,null,null,null,null,null,null,null,null,"Inflated Total","Uninfl. Total","Base","Cont.","%",null,"Inflation Rates"]
[null,"DISTRICT:","Culpeper",null,null,"Rev: 6/30/23",null,null,null,null,null,null,null,"PE",{"$f":"P4*U4","v":354775},{"$f":"Q4+R4","v":354775},{"$f":"O30","v":308500},{"$f":"R30","v":46275},{"$f":"IF(Q4>0,R4/Q4,0)","v":0.15},null,{"$f":"'CEWB Translation Sheet'!L4","v":1}]
[null,null,null,null,null,null,null,null,null,null,null,null,null,"RW",{"$f":"P5*U5","v":0},{"$f":"Q5+R5","v":0},{"$f":"O36","v":0},{"$f":"R36","v":0},{"$f":"IF(Q5>0,R5/Q5,0)","v":0},null,{"$f":"'CEWB Translation Sheet'!L5","v":1}]
[null,"PROJECT INFORMATION",null,null,null,null,null,null,null,null,null,null,null,"CN",{"$f":"P6*U6","v":0},{"$f":"Q6+R6+R7","v":0},{"$f":"O63","v":0},{"$f":"O65","v":0},{"$f":"IF(Q6>0,R6/Q6,0)","v":0},null,{"$f":"'CEWB Translation Sheet'!L6","v":1}]
[null,"Project Description",null,null,null,null,"PROJECT SCHEDULE",null,null,null,null,null,null,"CEI",null,null,null,{"$f":"O64","v":0},{"$f":"IF(Q6>0,R7/Q6,0)","v":0}]
[null,"Application ID",null,null,null,null,"PE Start Date",null,null,"ROUND TYPE",null,null,null,"Total",{"$f":"SUM(O4:O6)","v":354775},{"$f":"SUM(P4:P6)","v":354775},{"$f":"SUM(Q4:Q6)","v":308500},{"$f":"SUM(R4:R7)","v":46275}]
{"$rows_left_out":60}
{"sheet":"Suggested Contingencies","index":6,"n_rows":26,"n_cols":17,"rows_kept":26,"cut":false,"hidden":false,"merged":[[10,13,11,16],[14,14,15,16],[17,12,18,13],[17,14,18,14],[17,15,18,15],[17,16,18,16],[19,12,20,13],[19,14,20,14],[19,15,20,15],[19,16,20,16],[21,12,22,13],[21,14,22,14],[21,15,22,15],[21,16,22,16],[23,13,24,16],[25,1,34,6],[22,1,24,6],[1,1,3,6],[5,1,8,3],[5,6,8,6],[5,7,8,10],[9,1,10,3],[9,7,12,10],[11,1,12,3],[13,1,16,3],[13,4,16,4],[13,7,17,10],[17,1,17,3],[18,1,21,6],[13,5,16,5],[13,6,16,6],[9,4,10,4],[9,5,10,5],[9,6,10,6],[11,6,12,6],[11,4,12,4],[11,5,12,5],[5,4,8,4],[5,5,8,5],[8,14,9,14],[8,15,9,15],[8,16,9,16],[4,12,5,13],[6,12,7,13],[8,12,9,13],[1,14,2,16],[4,14,5,14],[4,15,5,15],[4,16,5,16],[6,14,7,14],[6,15,7,15],[6,16,7,16]]}
[]
[null,"Suggested Contingency for Culpeper-developed Concept Estimates",null,null,null,null,null,null,null,null,null,null,null,null,"Sliding Scale Contingency- VDOT Cost Estimating Manual"]
[]
[null,null,null,null,null,null,null,null,null,null,null,null,null,"Risk","Low","MLE","High"]
[null,null,null,null,"Low Risk","More Risk","High Risk",null,null,null,null,null,"Non-Complex",null,"20-23%","30-35%","45-55%"]
[null,"PE",null,null,0.1,0.15,"20%-30%","Use 5% contingency when Consultant rates are used by project is anticipated to be in-house. Increase for highly likely consultant projects or estimates with in-house rates."]
[null,null,null,null,null,null,null,null,null,null,null,null,"Moderately Complex",null,"25-30%","40-50%","60-75%"]
[]
{"$rows_left_out":19}
{"sheet":"CN Estimate Tool","index":7,"n_rows":58,"n_cols":13,"rows_kept":58,"cut":false,"hidden":false,"merged":[[24,3,24,6],[22,3,22,6],[25,3,25,6],[9,2,9,4],[10,2,10,4],[11,2,11,4],[12,2,12,4],[13,1,14,4],[15,2,15,3],[25,1,25,2],[1,0,2,5],[5,1,5,4],[6,1,6,4],[8,2,8,4],[3,2,3,4],[7,2,7,4],[37,1,37,2],[31,3,31,6],[32,3,32,6],[33,3,33,6],[34,3,34,6],[36,3,36,6],[32,1,32,2],[33,1,33,2],[34,1,34,2],[36,1,36,2],[35,1,35,2],[5,12,6,12],[5,7,6,7],[5,8,6,8],[5,9,6,9],[5,10,6,10],[5,11,6,11],[19,11,19,12],[20,11,20,12],[31,1,31,2],[26,1,26,2],[27,1,27,2],[28,1,28,2],[29,1,29,2],[30,1,30,2],[26,3,26,6],[27,3,27,6],[28,3,28,6],[29,3,29,6],[30,3,30,6],[22,1,22,2],[23,1,23,2],[24,1,24,2],[39,1,39,4],[40,1,40,4],[41,1,41,4],[52,1,52,4],[42,1,42,4],[43,1,43,4],[44,1,44,4],[45,1,45,4],[46,1,46,4],[47,1,47,4],[48,1,48,4],[49,1,49,4],[50,1,50,4],[51,1,51,4]]}
[]
["CONCEPTUAL CONSTRUCTION ESTIMATING TOOL"]
[]
[null,"DISTRICT:",{"$f":"'Culpeper Workbook'!$C$4","v":"Culpeper"},null,null,"Rev: 6/5/2023"]
[]
[null,"PROJECT INFORMATION",null,null,null,null,"TOTAL SUMMARY","Base Estimate","Conting. %","Conting. Amount","Total Estimate","% of Contract","Override % of Con."]
[null,{"$f":"'Culpeper Workbook'!C7","v":0}]
[null,"App ID or UPC",{"$f":"'Culpeper Workbook'!$C$8","v":0}]
{"$rows_left_out":51}
{"sheet":"Quantity Calculations","index":8,"n_rows":586,"n_cols":58,"rows_kept":586,"cut":false,"hidden":false,"merged":[[410,6,410,7],[410,8,410,9],[414,2,414,4],[7,11,7,13],[228,2,231,10],[77,2,80,10],[107,2,110,10],[122,6,122,8],[202,6,202,7],[202,9,202,10],[145,3,145,4],[145,6,145,8],[168,3,168,4],[168,6,168,8],[208,6,208,7],[380,8,380,9],[5,2,6,2],[82,2,83,2],[112,2,113,2],[112,6,112,8],[85,3,85,4],[1,6,1,7],[548,2,549,5],[564,2,567,10],[553,3,553,4],[0,1,1,4],[494,8,494,9],[482,2,483,5],[391,6,391,7],[391,8,391,9],[35,10,35,12],[320,2,323,10],[325,2,326,2],[233,2,234,2],[280,3,280,4],[327,6,327,10],[257,3,257,4],[486,8,486,9],[122,3,122,4],[0,5,0,6],[490,3,490,4],[528,2,529,2],[436,2,439,10],[441,2,442,2],[394,3,394,4],[457,3,457,4],[454,6,454,7],[454,8,454,9],[341,3,341,4],[372,2,375,10],[377,2,378,5],[399,3,399,4],[477,2,480,10],[586,2,589,10],[569,2,570,5],[575,3,575,4],[2,3,2,4],[3,3,3,4],[530,3,530,4],[543,2,546,10],[523,2,526,10],[512,3,512,4],[508,3,508,4],[504,3,504,4],[494,6,494,7],[498,3,498,4],[486,6,486,7],[496,5,496,10],[380,6,380,7],[385,6,385,7],[385,8,385,9],[386,6,386,7],[386,8,386,9],[381,6,381,7],[381,8,381,9],[382,6,382,7],[382,8,382,9],[384,6,384,7],[384,8,384,9],[383,6,383,7],[383,8,383,9],[387,6,387,7],[387,8,387,9],[388,6,388,7],[388,8,388,9],[390,6,390,7],[390,8,390,9],[389,6,389,7],[389,8,389,9]]}
[null,"Quantity Calculations",null,null,null,{"$f":"'CN Estimate Tool'!F4","v":"Rev: 6/5/2023"}]
[null,null,null,null,null,null,"Update Workbook:"]
[null,null,{"$f":"'CN Estimate Tool'!B7","v":0},{"$f":"IF(NOT('CN Estimate Tool'!C10=0),'CN Estimate Tool'!C10,\"\")","v":""}]
[null,null,{"$f":"IF(NOT('CN Estimate Tool'!C9=0),'CN Estimate Tool'!C9,\"\")","v":""},{"$f":"IF(NOT('CN Estimate Tool'!C12=0),'CN Estimate Tool'!C12,\"\")","v":""}]
[]
[null,null,"EARTHWORK ITEMS"]
[]
[null,null,"EARTHWORK TYPICAL SECTIONS",null,null,null,null,null,null,null,null,"QUANTITY CALCULATIONS",null,null,null,null,null,null,null,null,null,null,null,null,null,null,null,null,null,"HALF SECTION AREAS BY CASE"]
{"$rows_left_out":579}
{"sheet":"Earthwork","index":9,"n_rows":27,"n_cols":18,"rows_kept":27,"cut":false,"hidden":true,"merged":[]}
["Description","Length","Case","Section","Area","Width (W)","Max Depth","Min Depth","Widest Depth","Prop. Slope","Prop. Drainage","Prop. Pvmt W","Prop. Pvmt D","Exist. Slope","Exist. Drainage","Exist. Pvmt W","Exist. Pvmt D","Terrain Slope"]
[]
[]
[]
[]
[]
[]
[]
{"$rows_left_out":20}
{"sheet":"Suggested Values","index":10,"n_rows":31,"n_cols":6,"rows_kept":31,"cut":false,"hidden":true,"merged":[]}
[]
[]
[]
[]
[]
["Quantity Related"]
["Typical Unsuitable Earthwork Percentage",0.15]
["Typical Variable Overlay Depth",6,"IN"]
{"$rows_left_out":24}
{"sheet":"Unit Prices","index":11,"n_rows":208,"n_cols":11,"rows_kept":208,"cut":false,"hidden":false,"merged":[[0,1,1,1],[0,2,0,3],[2,2,2,3],[3,2,3,3]]}
[null,"Unit Cost Entry",{"$f":"'CN Estimate Tool'!F4","v":"Rev: 6/5/2023"}]
[]
[null,{"$f":"'CN Estimate Tool'!B7","v":0},{"$f":"IF(NOT('CN Estimate Tool'!C10=0),'CN Estimate Tool'!C10,\"\")","v":""}]
[null,{"$f":"IF(NOT('CN Estimate Tool'!C9=0),'CN Estimate Tool'!C9,\"\")","v":""},{"$f":"IF(NOT('CN Estimate Tool'!C12=0),'CN Estimate Tool'!C12,\"\")","v":""}]
[null,null,null,null,null,null,null,null,null,"Norms Updated:"]
[null,{"$f":"IF(K6=0,\"\",CONCATENATE(\"WARNING- \",K6,\" ITEMS MISSING COSTS\"))","v":""},null,null,null,null,null,null,null,{"$f":"'Unit Cost Norms'!F6","v":45082},{"$f":"SUM(K9:K199)","v":0}]
[null,"GRADING ITEMS","---",null,null,null,null,"Estimate",null,{"$f":"'Unit Cost Norms'!$D$6","v":"Culpeper"}]
["Item Code","Description","Quantity","Units","Unit Cost","Price Source","Remarks",{"$f":"SUM(H9:H19)","v":0},null,"Unit Norm"]
{"$rows_left_out":201}
{"sheet":"Unit Cost Norms","index":12,"n_rows":98,"n_cols":6,"rows_kept":98,"cut":false,"hidden":false,"merged":[[0,1,1,1],[2,2,2,3],[0,2,0,3],[5,1,5,2]]}
[null,{"$f":"_xlfn.CONCAT(D6,\" Unit Cost Norms\")","v":"Culpeper Unit Cost Norms"},{"$f":"'CN Estimate Tool'!F4","v":"Rev: 6/5/2023"}]
[]
[null,{"$f":"_xlfn.CONCAT(\"Typical Expected Costs- \",$E$7)","v":"Typical Expected Costs- Moderate Intersection Project"}]
[]
[null,"UNIT COST NORM DESCRIPTION"]
[null,"Unit Cost Norm Location:",null,"Culpeper","Date of Update:",45082]
[null,null,null,"Project Type:","Moderate Intersection Project"]
[null,"GRADING ITEMS"]
{"$rows_left_out":91}
{"sheet":"FormData","index":13,"n_rows":248,"n_cols":42,"rows_kept":248,"cut":false,"hidden":true,"merged":[]}
[null,null,null,null,null,null,"Pvmt Wts","XS Type","S. Slopes","Drainage","Dit. A/W","XS Type","Curb Type","Temp Erwk","Ret Wall Type","Ret Wall Method","SM","IM","BM","Agg Base",null,"Y/N","C/F","Est Method","Unit Cost Src","Update","Culp Counties","Pvmt Des","Admin","All Counties","District","Seed Method","MOT Method","Erwk Loc","Estimate Complexity","Locality Listing","UPC vs App ID","Round Type","Round Value",null,"Culpeper"]
["✓","✓","Yes","Tier 1","Consultant","Area","Culpeper","New Fill","4:1","6:1 Ditch",20,"Full Sect","Vertical","N/A","None","Earthwork","SM-9.5A","IM-19.0A","BM-25.0A","No. 21A","Concrete Barrier","Yes","Cut","None",{"$f":"_xlfn.CONCAT('Unit Cost Norms'!D6, \" Norm\")","v":"Culpeper Norm"},"Update","Albemarle","Design 1","VDOT","Arlington County (00)","Bristol","Area","None","Start","Non-Complex (Minor)","District","Application ID","None","Default","Culpeper","Albemarle County (02)","County"]
["N/A","✘","No","Tier 2","District","Count","C'ville","Widen Fill","3:1","4:1 Ditch",16,"Half Sect","Mountable","Sections","Gravity","Calculated","SM-9.5D","IM-19.0D","BM-25.0D","No. 21B","Guardrail","No","Fill","Percent","AWP Precon",null,"Charlottesville City","Design 2","Locality","Accomack County (01)","Culpeper","Length","CU Duration","Middle","Moderately Complex",null,"UPC","Portal","Manual","Northern Va","Arlington County (00)","County"]
["✘",null,null,null,"Central Office",null,"NoVa","New Cut","2:1","3:1 Ditch",12,null,null,"Use %","Alternative","Quantity","SM-12.5A","Other IM","Other BM","Other ABC","None","N/A",null,"Lump Sum","District Average",null,"Culpeper","Average",null,"Albemarle County (02)","Fredericksburg",null,"Percent","End","Most Complex (Major)",null,null,"Uninflated","More Round","Culpeper","Culpeper County (23)","County"]
[null,null,null,null,null,null,"Custom","Widen Cut","1.5:1","Curbing",0,null,null,null,null,null,"SM-12.5D",null,null,null,null,null,null,"4in Lines","District Linear",null,"Greene",null,null,"Alleghany County (03)","Hampton Rds",null,"Lump Sum","Average",null,null,null,"Inflated"]
[null,null,null,null,null,null,null,null,"Ret. Wall",null,null,null,null,null,null,null,"SM-12.5E",null,null,null,null,null,null,null,"District Non-Ln",null,"Fauquier",null,null,"Amelia County (04)","Lynchburg"]
[null,null,null,null,null,null,null,null,null,null,null,null,null,null,null,null,"Other SM",null,null,null,null,null,null,null,"District Range",null,"Fluvanna",null,null,"Amherst County (05)","Northern Va"]
[null,null,null,null,null,null,null,null,null,null,null,null,null,null,null,null,null,null,null,null,null,null,null,null,"State Average",null,"Louisa",null,null,"Appomattox County (06)","Richmond"]
{"$rows_left_out":241}
{"sheet":"PE Estimate Tool","index":14,"n_rows":222,"n_cols":18,"rows_kept":222,"cut":false,"hidden":false,"merged":[[52,5,52,9],[37,11,38,11],[37,12,38,12],[37,8,38,8],[37,9,38,9],[202,2,202,9],[210,2,210,9],[11,1,11,3],[107,2,107,9],[108,2,108,10],[132,1,132,3],[138,2,138,3],[138,4,138,6],[138,7,138,8],[144,2,144,9],[145,2,145,10],[37,1,38,1],[37,2,38,2],[37,3,38,3],[184,2,184,10],[187,1,187,3],[192,2,192,9],[193,2,193,10],[207,1,207,3],[211,2,211,9],[212,2,212,9],[218,2,218,3],[218,4,218,6],[218,7,218,8],[219,2,219,9],[220,2,220,9],[221,2,221,10],[35,2,36,10],[173,4,173,6],[173,7,173,8],[189,2,189,3],[189,4,189,6],[189,7,189,8],[183,2,183,9],[173,2,173,3],[54,1,54,3],[66,2,66,9],[67,2,67,10],[80,1,80,3],[95,2,95,9],[93,2,93,3],[93,7,93,8],[93,4,93,6],[196,1,196,3],[203,2,203,9],[204,2,204,10],[159,2,159,9],[160,2,160,10],[65,2,65,9],[75,2,75,9],[94,2,94,9],[106,2,106,9],[127,2,127,9],[143,2,143,9],[158,2,158,9],[111,1,111,3],[128,2,128,9],[129,2,129,10],[163,1,163,3],[217,1,217,3],[213,2,213,9],[214,2,214,10],[28,6,28,8],[28,9,28,10],[32,1,32,3],[32,8,32,9],[27,2,27,3],[27,6,27,10],[32,4,32,7],[28,1,30,3],[96,2,96,10],[37,4,38,4],[37,5,38,5],[37,6,38,6],[37,7,38,7],[37,10,38,10],[70,1,70,3],[76,2,76,9],[77,2,77,10],[99,1,99,3],[191,2,191,9],[182,2,182,9],[148,1,148,3],[12,7,12,8],[5,8,5,9],[1,6,3,10],[3,1,3,3],[34,2,34,6],[1,1,1,3],[2,1,2,3],[8,2,8,3],[9,2,9,3],[19,6,25,10],[4,2,4,3],[4,7,4,9],[5,2,5,3],[7,2,7,3],[6,2,6,3],[9,7,9,8],[10,7,10,8],[11,7,11,8],[14,10,14,12],[11,10,11,12]]}
[]
[null,"PROJECT INFORMATION",null,null,null,null,"CONCEPTUAL PE ESTIMATING TOOL"]
[null,{"$f":"'Culpeper Workbook'!C7","v":0}]
[null,"Enter Project Description"]
[null,"App. ID or UPC",{"$f":"'Culpeper Workbook'!$C$8","v":0},null,null,null,null,{"$f":"CONCATENATE(\"DISTRICT:  \",'Culpeper Workbook'!$C$4)","v":"DISTRICT:  Culpeper"},null,null,"Rev: 6/6/23"]
[null,"App. ID or UPC",null,null,null,null,null,"DISTRICT:","Culpeper",null,{"$f":"K5","v":"Rev: 6/6/23"}]
[null,"County/City/Town",{"$f":"'Culpeper Workbook'!$C$9","v":0}]
[null,"County/City/Town"]
{"$rows_left_out":215}
{"sheet":"PE % Check","index":15,"n_rows":65,"n_cols":9,"rows_kept":65,"cut":false,"hidden":true,"merged":[[1,1,1,2],[2,1,2,2],[3,1,3,2],[4,1,4,2],[14,1,14,2]]}
[]
[null,"CONCEPTUAL PE ESTIMATING TOOL",null,null,null,null,null,"CN Value","Percent PE"]
[null,"This tool can be used as an extra check to",null,null,null,null,null,0,0.75]
[null,"compare the PE estimate to typical PE costs",null,null,null,null,null,200000,0.75]
[null,"relative to the construction estimate.",null,null,null,null,null,300000,0.57999999999999996]
[null,null,null,null,null,null,null,400000,0.5]
[null,"Total CN Estimate",5000000,null,null,null,null,500000,0.45]
[null,null,null,null,null,null,null,600000,0.42]
{"$rows_left_out":58}
{"sheet":"PE Form Data","index":16,"n_rows":12,"n_cols":12,"rows_kept":12,"cut":false,"hidden":true,"merged":[]}
["✓","✓","Yes","Tier 1","Consultant","Urban",2023,"VDOT","N/A or Done","1\"=25'","Lump Sum","Show"]
["N/A","✘","No","Tier 2","District","Rural",2024,"Locality","Interstate IAR","1\"=50'","Manhour","Hide"]
["✘",null,null,null,"Central Office",null,2025,null,"Interst. OSAR"]
[null,null,null,null,"Local Staff",null,2026,null,"Other IAR"]
[null,null,null,null,null,null,2027,null,"Other OSAR"]
[null,null,null,null,null,null,2028]
[null,null,null,null,null,null,2029]
[null,null,null,null,null,null,2030]
{"$rows_left_out":5}
{"sheet":"PE Hour Norms","index":17,"n_rows":77,"n_cols":10,"rows_kept":77,"cut":false,"hidden":false,"merged":[[8,6,8,7],[8,8,8,9],[0,1,1,3],[2,1,2,3],[3,1,3,3],[4,1,4,3],[8,3,8,4],[33,3,33,4],[33,6,33,7],[33,8,33,9],[18,6,18,7],[36,3,36,4],[36,6,36,7],[36,8,36,9],[18,3,18,4],[18,8,18,9],[24,3,24,4],[24,6,24,7],[24,8,24,9],[46,3,46,4],[46,6,46,7],[46,8,46,9],[52,3,52,4],[52,6,52,7],[52,8,52,9],[56,3,56,4],[56,6,56,7],[56,8,56,9],[74,3,74,4],[74,6,74,7],[74,8,74,9],[66,3,66,4],[66,6,66,7],[66,8,66,9],[69,3,69,4],[69,6,69,7],[69,8,69,9]]}
[null,"P.E. Manhour Norms",null,null,null,{"$f":"'PE Estimate Tool'!K9","v":0}]
[]
[null,"Statewide Norms + Culpeper Projects",null,null,null,"Design Complexity Multipliers:"]
[null,"Updated 6/6/2023",null,null,null,"Simple",0.75]
[null,null,null,null,null,"Moderate",1]
[null,null,null,null,null,"Complex",{"$f":"4/3","v":1.3333333333333333}]
[null,null,null,null,null,"None",0]
[]
{"$rows_left_out":69}